{"text_format":"1","workbook":"xlsx","n_sheets":4,"sheets":["Instructions","Job Infomation","Sechdule","Material"],"not_rendered":{"charts":0,"images":0,"macros":1,"external_links":0,"defined_names":0,"comments":0,"pivot_tables":0},"unopened":[],"bounds":{"document_bytes":16777216,"sheet_cells":100000,"rows_first":2000,"rows_last":500,"rows_between":2000,"halvings":0,"cell_chars":16384,"cell_head_chars":4096},"cells_cut":0,"cells_raw":0,"read":"whole","date_system":"1900"}

{"sheet":"Instructions","index":0,"n_rows":44,"n_cols":3,"rows_kept":44,"cut":false,"hidden":false,"merged":[[41,0,41,2],[40,0,40,2],[35,0,35,2],[43,0,43,2],[0,0,0,2],[36,0,36,2],[16,0,16,2],[39,0,39,2],[2,0,2,2],[38,0,38,2],[28,0,28,2],[42,0,42,2],[37,0,37,2]]}
["FIRE ALARM INSTALLATION SCHEDULE - USER GUIDE"]
[]
["STEP 1: JOB INFORMATION PAGE"]
["Field","Description","Example"]
["Job #","Enter the job number","G2030"]
["Job Name","Enter the project name","1100 Columbia"]
["RAR PM","RAR Project Manager name","John Smith"]
["FA PM","Fire Alarm Project Manager name","Paul N."]
["PCI","PCI designation","C5"]
["Subcontractor","Subcontractor name (if applicable)","ABC Fire Systems"]
["How many phases?","Enter number of phases (1-50)","5"]
["Hours per man per day","Work hours per person per day","8"]
["Days per week on site","Working days per week","4"]
["Minutes per Point","Time to complete one point","30"]
["RER Fire Managment","Percentage for fire management overhead","10%"]
{"$rows_left_out":30}
{"sheet":"Job Infomation","index":1,"n_rows":22,"n_cols":9,"rows_kept":22,"cut":false,"hidden":false,"merged":[]}
["Job #","G2090"]
["Job Name","The Grounds"]
["RAR PM","Brad S.",null,null,null,null,null,"Rough in ",0.5]
["FA PM","Paul N.",null,null,null,null,null,"Trim ",0.6]
["PCI","C5"]
["Subcontractor","RER Fire"]
["How many phases?",4]
["Unit count:"]
["Rough in Complete Per Unit:"]
["Trim complete Per Unit:"]
[]
["Enter number of phases (1-50), then click \"Update Schedule\" button"]
["Schedule sheet will automatically update headers and data with Rough-in, Trim, Commissioning, Final, and Turnover phases"]
["Points per Phase (now on Schedule sheet - each phase can differ)"]
["Start Date (now on Schedule sheet)"]
{"$rows_left_out":8}
{"sheet":"Sechdule","index":2,"n_rows":13,"n_cols":256,"rows_kept":13,"cut":false,"hidden":false,"merged":[]}
["Job #","Job Name","PM FA","PM RAR","Subcontractor","PCI","Rough-in Phase 1","Rough-in Phase 2","Rough-in Phase 3","Rough-in Phase 4","Rough-in Phase 5","Rough-in Phase 6","Rough-in Phase 7","Rough-in Phase 8","Rough-in Phase 9","Rough-in Phase 10","Rough-in Phase 11","Rough-in Phase 12","Rough-in Phase 13","Rough-in Phase 14","Rough-in Phase 15","Rough-in Phase 16","Rough-in Phase 17","Rough-in Phase 18","Rough-in Phase 19","Rough-in Phase 20","Rough-in Phase 21","Rough-in Phase 22","Rough-in Phase 23","Rough-in Phase 24","Rough-in Phase 25","Rough-in Phase 26","Rough-in Phase 27","Rough-in Phase 28","Rough-in Phase 29","Rough-in Phase 30","Rough-in Phase 31","Rough-in Phase 32","Rough-in Phase 33","Rough-in Phase 34","Rough-in Phase 35","Rough-in Phase 36","Rough-in Phase 37","Rough-in Phase 38","Rough-in Phase 39","Rough-in Phase 40","Rough-in Phase 41","Rough-in Phase 42","Rough-in Phase 43","Rough-in Phase 44","Rough-in Phase 45","Rough-in Phase 46","Rough-in Phase 47","Rough-in Phase 48","Rough-in Phase 49","Rough-in Phase 50","Trim Phase 1","Trim Phase 2","Trim Phase 3","Trim Phase 4","Trim Phase 5","Trim Phase 6","Trim Phase 7","Trim Phase 8","Trim Phase 9","Trim Phase 10","Trim Phase 11","Trim Phase 12","Trim Phase 13","Trim Phase 14","Trim Phase 15","Trim Phase 16","Trim Phase 17","Trim Phase 18","Trim Phase 19","Trim Phase 20","Trim Phase 21","Trim Phase 22","Trim Phase 23","Trim Phase 24","Trim Phase 25","Trim Phase 26","Trim Phase 27","Trim Phase 28","Trim Phase 29","Trim Phase 30","Trim Phase 31","Trim Phase 32","Trim Phase 33","Trim Phase 34","Trim Phase 35","Trim Phase 36","Trim Phase 37","Trim Phase 38","Trim Phase 39","Trim Phase 40","Trim Phase 41","Trim Phase 42","Trim Phase 43","Trim Phase 44","Trim Phase 45","Trim Phase 46","Trim Phase 47","Trim Phase 48","Trim Phase 49","Trim Phase 50","Commissioning Phase 1","Commissioning Phase 2","Commissioning Phase 3","Commissioning Phase 4","Commissioning Phase 5","Commissioning Phase 6","Commissioning Phase 7","Commissioning Phase 8","Commissioning Phase 9","Commissioning Phase 10","Commissioning Phase 11","Commissioning Phase 12","Commissioning Phase 13","Commissioning Phase 14","Commissioning Phase 15","Commissioning Phase 16","Commissioning Phase 17","Commissioning Phase 18","Commissioning Phase 19","Commissioning Phase 20","Commissioning Phase 21","Commissioning Phase 22","Commissioning Phase 23","Commissioning Phase 24","Commissioning Phase 25","Commissioning Phase 26","Commissioning Phase 27","Commissioning Phase 28","Commissioning Phase 29","Commissioning Phase 30","Commissioning Phase 31","Commissioning Phase 32","Commissioning Phase 33","Commissioning Phase 34","Commissioning Phase 35","Commissioning Phase 36","Commissioning Phase 37","Commissioning Phase 38","Commissioning Phase 39","Commissioning Phase 40","Commissioning Phase 41","Commissioning Phase 42","Commissioning Phase 43","Commissioning Phase 44","Commissioning Phase 45","Commissioning Phase 46","Commissioning Phase 47","Commissioning Phase 48","Commissioning Phase 49","Commissioning Phase 50","Final Phase 1","Final Phase 2","Final Phase 3","Final Phase 4","Final Phase 5","Final Phase 6","Final Phase 7","Final Phase 8","Final Phase 9","Final Phase 10","Final Phase 11","Final Phase 12","Final Phase 13","Final Phase 14","Final Phase 15","Final Phase 16","Final Phase 17","Final Phase 18","Final Phase 19","Final Phase 20","Final Phase 21","Final Phase 22","Final Phase 23","Final Phase 24","Final Phase 25","Final Phase 26","Final Phase 27","Final Phase 28","Final Phase 29","Final Phase 30","Final Phase 31","Final Phase 32","Final Phase 33","Final Phase 34","Final Phase 35","Final Phase 36","Final Phase 37","Final Phase 38","Final Phase 39","Final Phase 40","Final Phase 41","Final Phase 42","Final Phase 43","Final Phase 44","Final Phase 45","Final Phase 46","Final Phase 47","Final Phase 48","Final Phase 49","Final Phase 50","Turnover Phase 1","Turnover Phase 2","Turnover Phase 3","Turnover Phase 4","Turnover Phase 5","Turnover Phase 6","Turnover Phase 7","Turnover Phase 8","Turnover Phase 9","Turnover Phase 10","Turnover Phase 11","Turnover Phase 12","Turnover Phase 13","Turnover Phase 14","Turnover Phase 15","Turnover Phase 16","Turnover Phase 17","Turnover Phase 18","Turnover Phase 19","Turnover Phase 20","Turnover Phase 21","Turnover Phase 22","Turnover Phase 23","Turnover Phase 24","Turnover Phase 25","Turnover Phase 26","Turnover Phase 27","Turnover Phase 28","Turnover Phase 29","Turnover Phase 30","Turnover Phase 31","Turnover Phase 32","Turnover Phase 33","Turnover Phase 34","Turnover Phase 35","Turnover Phase 36","Turnover Phase 37","Turnover Phase 38","Turnover Phase 39","Turnover Phase 40","Turnover Phase 41","Turnover Phase 42","Turnover Phase 43","Turnover Phase 44","Turnover Phase 45","Turnover Phase 46","Turnover Phase 47","Turnover Phase 48","Turnover Phase 49","Turnover Phase 50"]
[{"$f":"'Job Infomation'!B1","v":"G2090"},{"$f":"'Job Infomation'!B2","v":"The Grounds"},{"$f":"'Job Infomation'!B4","v":"Paul N."},{"$f":"'Job Infomation'!B3","v":"Brad S."},{"$f":"'Job Infomation'!B6","v":"RER Fire"},{"$f":"'Job Infomation'!B5","v":"C5"}]
["Points per Phase",null,null,null,null,null,465,498,511,35,100,null,null,null,null,null,null,null,null,null,null,null,null,null,null,null,null,null,null,null,null,null,null,null,null,null,null,null,null,null,null,null,null,null,null,null,null,null,null,null,null,null,null,null,null,null,{"$f":"G3","v":465},{"$f":"H3","v":498},{"$f":"I3","v":511},{"$f":"J3","v":35},100,null,null,null,null,null,null,null,null,null,null,null,null,null,null,null,null,null,null,null,null,null,null,null,null,null,null,null,null,null,null,null,null,null,null,null,null,null,null,null,null,null,null,null,null,null,{"$f":"G3","v":465},{"$f":"H3","v":498},{"$f":"I3","v":511},{"$f":"J3","v":35},100,null,null,null,null,null,null,null,null,null,null,null,null,null,null,null,null,null,null,null,null,null,null,null,null,null,null,null,null,null,null,null,null,null,null,null,null,null,null,null,null,null,null,null,null,null,{"$f":"BE3","v":465},{"$f":"BF3","v":498},{"$f":"BG3","v":511},{"$f":"BH3","v":35},100,null,null,null,null,null,null,null,null,null,null,null,null,null,null,null,null,null,null,null,null,null,null,null,null,null,null,null,null,null,null,null,null,null,null,null,null,null,null,null,null,null,null,null,null,null,{"$f":"DC3","v":465},{"$f":"DD3","v":498},{"$f":"DE3","v":511},{"$f":"DF3","v":35},100]
["Mobilization Date"]
["Start Date",null,null,null,null,null,"2026-08-25"]
["Due Date",null,null,null,null,null,"2026-09-01"]
["Men on Site",null,null,null,null,null,{"$f":"IFERROR(IF(AND(G5<>\"\",G6<>\"\"),ROUNDUP((G3*'Job Infomation'!$B$20/60)/((G6-G5)*('Job Infomation'!$B$19/7)*'Job Infomation'!$B$18),0),\"\"),\"\")","v":6},{"$f":"IFERROR(IF(AND(H5<>\"\",H6<>\"\"),ROUNDUP((H3*'Job Infomation'!$B$20/60)/((H6-H5)*('Job Infomation'!$B$19/7)*'Job Infomation'!$B$18),0),\"\"),\"\")","v":""},{"$f":"IFERROR(IF(AND(I5<>\"\",I6<>\"\"),ROUNDUP((I3*'Job Infomation'!$B$20/60)/((I6-I5)*('Job Infomation'!$B$19/7)*'Job Infomation'!$B$18),0),\"\"),\"\")","v":""},{"$f":"IFERROR(IF(AND(J5<>\"\",J6<>\"\"),ROUNDUP((J3*'Job Infomation'!$B$20/60)/((J6-J5)*('Job Infomation'!$B$19/7)*'Job Infomation'!$B$18),0),\"\"),\"\")","v":""},{"$f":"IFERROR(IF(AND(K5<>\"\",K6<>\"\"),ROUNDUP((K3*'Job Infomation'!$B$20/60)/((K6-K5)*('Job Infomation'!$B$19/7)*'Job Infomation'!$B$18),0),\"\"),\"\")","v":""},null,null,null,null,null,null,null,null,null,null,null,null,null,null,null,null,null,null,null,null,null,null,null,null,null,null,null,null,null,null,null,null,null,null,null,null,null,null,null,null,null,null,null,null,null,{"$f":"IFERROR(IF(AND(BE5<>\"\",BE6<>\"\"),ROUNDUP((BE3*'Job Infomation'!$B$20/60)/((BE6-BE5)*('Job Infomation'!$B$19/7)*'Job Infomation'!$B$18),0),\"\"),\"\")","v":""},{"$f":"IFERROR(IF(AND(BF5<>\"\",BF6<>\"\"),ROUNDUP((BF3*'Job Infomation'!$B$20/60)/((BF6-BF5)*('Job Infomation'!$B$19/7)*'Job Infomation'!$B$18),0),\"\"),\"\")","v":""},{"$f":"IFERROR(IF(AND(BG5<>\"\",BG6<>\"\"),ROUNDUP((BG3*'Job Infomation'!$B$20/60)/((BG6-BG5)*('Job Infomation'!$B$19/7)*'Job Infomation'!$B$18),0),\"\"),\"\")","v":""},{"$f":"IFERROR(IF(AND(BH5<>\"\",BH6<>\"\"),ROUNDUP((BH3*'Job Infomation'!$B$20/60)/((BH6-BH5)*('Job Infomation'!$B$19/7)*'Job Infomation'!$B$18),0),\"\"),\"\")","v":""},{"$f":"IFERROR(IF(AND(BI5<>\"\",BI6<>\"\"),ROUNDUP((BI3*'Job Infomation'!$B$20/60)/((BI6-BI5)*('Job Infomation'!$B$19/7)*'Job Infomation'!$B$18),0),\"\"),\"\")","v":""},null,null,null,null,null,null,null,null,null,null,null,null,null,null,null,null,null,null,null,null,null,null,null,null,null,null,null,null,null,null,null,null,null,null,null,null,null,null,null,null,null,null,null,null,null,{"$f":"IFERROR(IF(AND(DC5<>\"\",DC6<>\"\"),ROUNDUP((DC3*'Job Infomation'!$B$20/60)/((DC6-DC5)*('Job Infomation'!$B$19/7)*'Job Infomation'!$B$18),0),\"\"),\"\")","v":""},{"$f":"IFERROR(IF(AND(DD5<>\"\",DD6<>\"\"),ROUNDUP((DD3*'Job Infomation'!$B$20/60)/((DD6-DD5)*('Job Infomation'!$B$19/7)*'Job Infomation'!$B$18),0),\"\"),\"\")","v":""},{"$f":"IFERROR(IF(AND(DE5<>\"\",DE6<>\"\"),ROUNDUP((DE3*'Job Infomation'!$B$20/60)/((DE6-DE5)*('Job Infomation'!$B$19/7)*'Job Infomation'!$B$18),0),\"\"),\"\")","v":""},{"$f":"IFERROR(IF(AND(DF5<>\"\",DF6<>\"\"),ROUNDUP((DF3*'Job Infomation'!$B$20/60)/((DF6-DF5)*('Job Infomation'!$B$19/7)*'Job Infomation'!$B$18),0),\"\"),\"\")","v":""},{"$f":"IFERROR(IF(AND(DG5<>\"\",DG6<>\"\"),ROUNDUP((DG3*'Job Infomation'!$B$20/60)/((DG6-DG5)*('Job Infomation'!$B$19/7)*'Job Infomation'!$B$18),0),\"\"),\"\")","v":""},null,null,null,null,null,null,null,null,null,null,null,null,null,null,null,null,null,null,null,null,null,null,null,null,null,null,null,null,null,null,null,null,null,null,null,null,null,null,null,null,null,null,null,null,null,{"$f":"IFERROR(IF(AND(FA5<>\"\",FA6<>\"\"),ROUNDUP((FA4*'Job Infomation'!$B$20/60)/((FA6-FA5)*('Job Infomation'!$B$19/7)*'Job Infomation'!$B$18),0),\"\"),\"\")","v":""},{"$f":"IFERROR(IF(AND(FB5<>\"\",FB6<>\"\"),ROUNDUP((FB4*'Job Infomation'!$B$20/60)/((FB6-FB5)*('Job Infomation'!$B$19/7)*'Job Infomation'!$B$18),0),\"\"),\"\")","v":""},{"$f":"IFERROR(IF(AND(FC5<>\"\",FC6<>\"\"),ROUNDUP((FC4*'Job Infomation'!$B$20/60)/((FC6-FC5)*('Job Infomation'!$B$19/7)*'Job Infomation'!$B$18),0),\"\"),\"\")","v":""},{"$f":"IFERROR(IF(AND(FD5<>\"\",FD6<>\"\"),ROUNDUP((FD3*'Job Infomation'!$B$20/60)/((FD6-FD5)*('Job Infomation'!$B$19/7)*'Job Infomation'!$B$18),0),\"\"),\"\")","v":""},{"$f":"IFERROR(IF(AND(FE5<>\"\",FE6<>\"\"),ROUNDUP((FE3*'Job Infomation'!$B$20/60)/((FE6-FE5)*('Job Infomation'!$B$19/7)*'Job Infomation'!$B$18),0),\"\"),\"\")","v":""},null,null,null,null,null,null,null,null,null,null,null,null,null,null,null,null,null,null,null,null,null,null,null,null,null,null,null,null,null,null,null,null,null,null,null,null,null,null,null,null,null,null,null,null,null,{"$f":"IFERROR(IF(AND(GY5<>\"\",GY6<>\"\"),ROUNDUP((GY3*'Job Infomation'!$B$20/60)/((GY6-GY5)*('Job Infomation'!$B$19/7)*'Job Infomation'!$B$18),0),\"\"),\"\")","v":""},{"$f":"IFERROR(IF(AND(GZ5<>\"\",GZ6<>\"\"),ROUNDUP((GZ3*'Job Infomation'!$B$20/60)/((GZ6-GZ5)*('Job Infomation'!$B$19/7)*'Job Infomation'!$B$18),0),\"\"),\"\")","v":""},{"$f":"IFERROR(IF(AND(HA5<>\"\",HA6<>\"\"),ROUNDUP((HA3*'Job Infomation'!$B$20/60)/((HA6-HA5)*('Job Infomation'!$B$19/7)*'Job Infomation'!$B$18),0),\"\"),\"\")","v":""},{"$f":"IFERROR(IF(AND(HB5<>\"\",HB6<>\"\"),ROUNDUP((HB3*'Job Infomation'!$B$20/60)/((HB6-HB5)*('Job Infomation'!$B$19/7)*'Job Infomation'!$B$18),0),\"\"),\"\")","v":""},{"$f":"IFERROR(IF(AND(HC5<>\"\",HC6<>\"\"),ROUNDUP((HC3*'Job Infomation'!$B$20/60)/((HC6-HC5)*('Job Infomation'!$B$19/7)*'Job Infomation'!$B$18),0),\"\"),\"\")","v":""}]
["Completed",null,null,null,null,null,false]
["Completion Date",null,null,null,null,null,{"$f":"IF(G8=TRUE,TODAY(),\"\")","v":""},{"$f":"IF(H8=TRUE,TODAY(),\"\")","v":""},{"$f":"IF(I8=TRUE,TODAY(),\"\")","v":""},{"$f":"IF(J8=TRUE,TODAY(),\"\")","v":""},{"$f":"IF(K8=TRUE,TODAY(),\"\")","v":""},null,null,null,null,null,null,null,null,null,null,null,null,null,null,null,null,null,null,null,null,null,null,null,null,null,null,null,null,null,null,null,null,null,null,null,null,null,null,null,null,null,null,null,null,null,{"$f":"IF(BE8=TRUE,TODAY(),\"\")","v":""},{"$f":"IF(BF8=TRUE,TODAY(),\"\")","v":""},{"$f":"IF(BG8=TRUE,TODAY(),\"\")","v":""},{"$f":"IF(BH8=TRUE,TODAY(),\"\")","v":""},{"$f":"IF(BI8=TRUE,TODAY(),\"\")","v":""},null,null,null,null,null,null,null,null,null,null,null,null,null,null,null,null,null,null,null,null,null,null,null,null,null,null,null,null,null,null,null,null,null,null,null,null,null,null,null,null,null,null,null,null,null,{"$f":"IF(DC8=TRUE,TODAY(),\"\")","v":""},{"$f":"IF(DD8=TRUE,TODAY(),\"\")","v":""},{"$f":"IF(DE8=TRUE,TODAY(),\"\")","v":""},{"$f":"IF(DF8=TRUE,TODAY(),\"\")","v":""},{"$f":"IF(DG8=TRUE,TODAY(),\"\")","v":""},null,null,null,null,null,null,null,null,null,null,null,null,null,null,null,null,null,null,null,null,null,null,null,null,null,null,null,null,null,null,null,null,null,null,null,null,null,null,null,null,null,null,null,null,null,{"$f":"IF(FA8=TRUE,TODAY(),\"\")","v":""},{"$f":"IF(FB8=TRUE,TODAY(),\"\")","v":""},{"$f":"IF(FC8=TRUE,TODAY(),\"\")","v":""},{"$f":"IF(FD8=TRUE,TODAY(),\"\")","v":""},{"$f":"IF(FE8=TRUE,TODAY(),\"\")","v":""},null,null,null,null,null,null,null,null,null,null,null,null,null,null,null,null,null,null,null,null,null,null,null,null,null,null,null,null,null,null,null,null,null,null,null,null,null,null,null,null,null,null,null,null,null,{"$f":"IF(GY8=TRUE,TODAY(),\"\")","v":""},{"$f":"IF(GZ8=TRUE,TODAY(),\"\")","v":""},{"$f":"IF(HA8=TRUE,TODAY(),\"\")","v":""},{"$f":"IF(HB8=TRUE,TODAY(),\"\")","v":""},{"$f":"IF(HC8=TRUE,TODAY(),\"\")","v":""}]
["Due Date Met",null,null,null,null,null,{"$f":"IF(AND(G8=TRUE,G9<>\"\"),IF(G9<=G6,\"TRUE\",\"FALSE\"),\"\")","v":""},{"$f":"IF(AND(H8=TRUE,H9<>\"\"),IF(H9<=H6,\"TRUE\",\"FALSE\"),\"\")","v":""},{"$f":"IF(AND(I8=TRUE,I9<>\"\"),IF(I9<=I6,\"TRUE\",\"FALSE\"),\"\")","v":""},{"$f":"IF(AND(J8=TRUE,J9<>\"\"),IF(J9<=J6,\"TRUE\",\"FALSE\"),\"\")","v":""},{"$f":"IF(AND(K8=TRUE,K9<>\"\"),IF(K9<=K6,\"TRUE\",\"FALSE\"),\"\")","v":""},null,null,null,null,null,null,null,null,null,null,null,null,null,null,null,null,null,null,null,null,null,null,null,null,null,null,null,null,null,null,null,null,null,null,null,null,null,null,null,null,null,null,null,null,null,{"$f":"IF(AND(BE8=TRUE,BE9<>\"\"),IF(BE9<=BE6,\"TRUE\",\"FALSE\"),\"\")","v":""},{"$f":"IF(AND(BF8=TRUE,BF9<>\"\"),IF(BF9<=BF6,\"TRUE\",\"FALSE\"),\"\")","v":""},{"$f":"IF(AND(BG8=TRUE,BG9<>\"\"),IF(BG9<=BG6,\"TRUE\",\"FALSE\"),\"\")","v":""},{"$f":"IF(AND(BH8=TRUE,BH9<>\"\"),IF(BH9<=BH6,\"TRUE\",\"FALSE\"),\"\")","v":""},{"$f":"IF(AND(BI8=TRUE,BI9<>\"\"),IF(BI9<=BI6,\"TRUE\",\"FALSE\"),\"\")","v":""},null,null,null,null,null,null,null,null,null,null,null,null,null,null,null,null,null,null,null,null,null,null,null,null,null,null,null,null,null,null,null,null,null,null,null,null,null,null,null,null,null,null,null,null,null,{"$f":"IF(AND(DC8=TRUE,DC9<>\"\"),IF(DC9<=DC6,\"TRUE\",\"FALSE\"),\"\")","v":""},{"$f":"IF(AND(DD8=TRUE,DD9<>\"\"),IF(DD9<=DD6,\"TRUE\",\"FALSE\"),\"\")","v":""},{"$f":"IF(AND(DE8=TRUE,DE9<>\"\"),IF(DE9<=DE6,\"TRUE\",\"FALSE\"),\"\")","v":""},{"$f":"IF(AND(DF8=TRUE,DF9<>\"\"),IF(DF9<=DF6,\"TRUE\",\"FALSE\"),\"\")","v":""},{"$f":"IF(AND(DG8=TRUE,DG9<>\"\"),IF(DG9<=DG6,\"TRUE\",\"FALSE\"),\"\")","v":""},null,null,null,null,null,null,null,null,null,null,null,null,null,null,null,null,null,null,null,null,null,null,null,null,null,null,null,null,null,null,null,null,null,null,null,null,null,null,null,null,null,null,null,null,null,{"$f":"IF(AND(FA8=TRUE,FA9<>\"\"),IF(FA9<=FA6,\"TRUE\",\"FALSE\"),\"\")","v":""},{"$f":"IF(AND(FB8=TRUE,FB9<>\"\"),IF(FB9<=FB6,\"TRUE\",\"FALSE\"),\"\")","v":""},{"$f":"IF(AND(FC8=TRUE,FC9<>\"\"),IF(FC9<=FC6,\"TRUE\",\"FALSE\"),\"\")","v":""},{"$f":"IF(AND(FD8=TRUE,FD9<>\"\"),IF(FD9<=FD6,\"TRUE\",\"FALSE\"),\"\")","v":""},{"$f":"IF(AND(FE8=TRUE,FE9<>\"\"),IF(FE9<=FE6,\"TRUE\",\"FALSE\"),\"\")","v":""},null,null,null,null,null,null,null,null,null,null,null,null,null,null,null,null,null,null,null,null,null,null,null,null,null,null,null,null,null,null,null,null,null,null,null,null,null,null,null,null,null,null,null,null,null,{"$f":"IF(AND(GY8=TRUE,GY9<>\"\"),IF(GY9<=GY6,\"TRUE\",\"FALSE\"),\"\")","v":""},{"$f":"IF(AND(GZ8=TRUE,GZ9<>\"\"),IF(GZ9<=GZ6,\"TRUE\",\"FALSE\"),\"\")","v":""},{"$f":"IF(AND(HA8=TRUE,HA9<>\"\"),IF(HA9<=HA6,\"TRUE\",\"FALSE\"),\"\")","v":""},{"$f":"IF(AND(HB8=TRUE,HB9<>\"\"),IF(HB9<=HB6,\"TRUE\",\"FALSE\"),\"\")","v":""},{"$f":"IF(AND(HC8=TRUE,HC9<>\"\"),IF(HC9<=HC6,\"TRUE\",\"FALSE\"),\"\")","v":""}]
["PCI Man Hours",null,null,null,null,null,{"$f":"IFERROR(IF(AND(G5<>\"\",G6<>\"\"),G7*'Job Infomation'!$B$18*(G6-G5),\"\"),\"\")","v":336},{"$f":"IFERROR(IF(AND(H5<>\"\",H6<>\"\"),H7*'Job Infomation'!$B$18*(H6-H5),\"\"),\"\")","v":""},{"$f":"IFERROR(IF(AND(I5<>\"\",I6<>\"\"),I7*'Job Infomation'!$B$18*(I6-I5),\"\"),\"\")","v":""},{"$f":"IFERROR(IF(AND(J5<>\"\",J6<>\"\"),J7*'Job Infomation'!$B$18*(J6-J5),\"\"),\"\")","v":""},{"$f":"IFERROR(IF(AND(K5<>\"\",K6<>\"\"),K7*'Job Infomation'!$B$18*(K6-K5),\"\"),\"\")","v":""},null,null,null,null,null,null,null,null,null,null,null,null,null,null,null,null,null,null,null,null,null,null,null,null,null,null,null,null,null,null,null,null,null,null,null,null,null,null,null,null,null,null,null,null,null,{"$f":"IFERROR(IF(AND(BE5<>\"\",BE6<>\"\"),BE7*'Job Infomation'!$B$18*(BE6-BE5),\"\"),\"\")","v":""},{"$f":"IFERROR(IF(AND(BF5<>\"\",BF6<>\"\"),BF7*'Job Infomation'!$B$18*(BF6-BF5),\"\"),\"\")","v":""},{"$f":"IFERROR(IF(AND(BG5<>\"\",BG6<>\"\"),BG7*'Job Infomation'!$B$18*(BG6-BG5),\"\"),\"\")","v":""},{"$f":"IFERROR(IF(AND(BH5<>\"\",BH6<>\"\"),BH7*'Job Infomation'!$B$18*(BH6-BH5),\"\"),\"\")","v":""},{"$f":"IFERROR(IF(AND(BI5<>\"\",BI6<>\"\"),BI7*'Job Infomation'!$B$18*(BI6-BI5),\"\"),\"\")","v":""},null,null,null,null,null,null,null,null,null,null,null,null,null,null,null,null,null,null,null,null,null,null,null,null,null,null,null,null,null,null,null,null,null,null,null,null,null,null,null,null,null,null,null,null,null,{"$f":"IFERROR(IF(AND(DC5<>\"\",DC6<>\"\"),DC7*'Job Infomation'!$B$18*(DC6-DC5),\"\"),\"\")","v":""},{"$f":"IFERROR(IF(AND(DD5<>\"\",DD6<>\"\"),DD7*'Job Infomation'!$B$18*(DD6-DD5),\"\"),\"\")","v":""},{"$f":"IFERROR(IF(AND(DE5<>\"\",DE6<>\"\"),DE7*'Job Infomation'!$B$18*(DE6-DE5),\"\"),\"\")","v":""},{"$f":"IFERROR(IF(AND(DF5<>\"\",DF6<>\"\"),DF7*'Job Infomation'!$B$18*(DF6-DF5),\"\"),\"\")","v":""},{"$f":"IFERROR(IF(AND(DG5<>\"\",DG6<>\"\"),DG7*'Job Infomation'!$B$18*(DG6-DG5),\"\"),\"\")","v":""},null,null,null,null,null,null,null,null,null,null,null,null,null,null,null,null,null,null,null,null,null,null,null,null,null,null,null,null,null,null,null,null,null,null,null,null,null,null,null,null,null,null,null,null,null,{"$f":"IFERROR(IF(AND(FA5<>\"\",FA6<>\"\"),FA7*'Job Infomation'!$B$18*(FA6-FA5),\"\"),\"\")","v":""},{"$f":"IFERROR(IF(AND(FB5<>\"\",FB6<>\"\"),FB7*'Job Infomation'!$B$18*(FB6-FB5),\"\"),\"\")","v":""},{"$f":"IFERROR(IF(AND(FC5<>\"\",FC6<>\"\"),FC7*'Job Infomation'!$B$18*(FC6-FC5),\"\"),\"\")","v":""},{"$f":"IFERROR(IF(AND(FD5<>\"\",FD6<>\"\"),FD7*'Job Infomation'!$B$18*(FD6-FD5),\"\"),\"\")","v":""},{"$f":"IFERROR(IF(AND(FE5<>\"\",FE6<>\"\"),FE7*'Job Infomation'!$B$18*(FE6-FE5),\"\"),\"\")","v":""},null,null,null,null,null,null,null,null,null,null,null,null,null,null,null,null,null,null,null,null,null,null,null,null,null,null,null,null,null,null,null,null,null,null,null,null,null,null,null,null,null,null,null,null,null,{"$f":"IFERROR(IF(AND(GY5<>\"\",GY6<>\"\"),GY7*'Job Infomation'!$B$18*(GY6-GY5),\"\"),\"\")","v":""},{"$f":"IFERROR(IF(AND(GZ5<>\"\",GZ6<>\"\"),GZ7*'Job Infomation'!$B$18*(GZ6-GZ5),\"\"),\"\")","v":""},{"$f":"IFERROR(IF(AND(HA5<>\"\",HA6<>\"\"),HA7*'Job Infomation'!$B$18*(HA6-HA5),\"\"),\"\")","v":""},{"$f":"IFERROR(IF(AND(HB5<>\"\",HB6<>\"\"),HB7*'Job Infomation'!$B$18*(HB6-HB5),\"\"),\"\")","v":""},{"$f":"IFERROR(IF(AND(HC5<>\"\",HC6<>\"\"),HC7*'Job Infomation'!$B$18*(HC6-HC5),\"\"),\"\")","v":""}]
["RER Fire Management Hours",null,null,null,null,null,{"$f":"IFERROR(IF(G11<>\"\",G11*'Job Infomation'!$B$21,\"\"),\"\")","v":67.2},{"$f":"IFERROR(IF(H11<>\"\",H11*'Job Infomation'!$B$21,\"\"),\"\")","v":""},{"$f":"IFERROR(IF(I11<>\"\",I11*'Job Infomation'!$B$21,\"\"),\"\")","v":""},{"$f":"IFERROR(IF(J11<>\"\",J11*'Job Infomation'!$B$21,\"\"),\"\")","v":""},{"$f":"IFERROR(IF(K11<>\"\",K11*'Job Infomation'!$B$21,\"\"),\"\")","v":""},null,null,null,null,null,null,null,null,null,null,null,null,null,null,null,null,null,null,null,null,null,null,null,null,null,null,null,null,null,null,null,null,null,null,null,null,null,null,null,null,null,null,null,null,null,{"$f":"IFERROR(IF(BE11<>\"\",BE11*'Job Infomation'!$B$21,\"\"),\"\")","v":""},{"$f":"IFERROR(IF(BF11<>\"\",BF11*'Job Infomation'!$B$21,\"\"),\"\")","v":""},{"$f":"IFERROR(IF(BG11<>\"\",BG11*'Job Infomation'!$B$21,\"\"),\"\")","v":""},{"$f":"IFERROR(IF(BH11<>\"\",BH11*'Job Infomation'!$B$21,\"\"),\"\")","v":""},{"$f":"IFERROR(IF(BI11<>\"\",BI11*'Job Infomation'!$B$21,\"\"),\"\")","v":""},null,null,null,null,null,null,null,null,null,null,null,null,null,null,null,null,null,null,null,null,null,null,null,null,null,null,null,null,null,null,null,null,null,null,null,null,null,null,null,null,null,null,null,null,null,{"$f":"IFERROR(IF(DC11<>\"\",DC11*'Job Infomation'!$B$21,\"\"),\"\")","v":""},{"$f":"IFERROR(IF(DD11<>\"\",DD11*'Job Infomation'!$B$21,\"\"),\"\")","v":""},{"$f":"IFERROR(IF(DE11<>\"\",DE11*'Job Infomation'!$B$21,\"\"),\"\")","v":""},{"$f":"IFERROR(IF(DF11<>\"\",DF11*'Job Infomation'!$B$21,\"\"),\"\")","v":""},{"$f":"IFERROR(IF(DG11<>\"\",DG11*'Job Infomation'!$B$21,\"\"),\"\")","v":""},null,null,null,null,null,null,null,null,null,null,null,null,null,null,null,null,null,null,null,null,null,null,null,null,null,null,null,null,null,null,null,null,null,null,null,null,null,null,null,null,null,null,null,null,null,{"$f":"IFERROR(IF(FA11<>\"\",FA11*'Job Infomation'!$B$21,\"\"),\"\")","v":""},{"$f":"IFERROR(IF(FB11<>\"\",FB11*'Job Infomation'!$B$21,\"\"),\"\")","v":""},{"$f":"IFERROR(IF(FC11<>\"\",FC11*'Job Infomation'!$B$21,\"\"),\"\")","v":""},{"$f":"IFERROR(IF(FD11<>\"\",FD11*'Job Infomation'!$B$21,\"\"),\"\")","v":""},{"$f":"IFERROR(IF(FE11<>\"\",FE11*'Job Infomation'!$B$21,\"\"),\"\")","v":""},null,null,null,null,null,null,null,null,null,null,null,null,null,null,null,null,null,null,null,null,null,null,null,null,null,null,null,null,null,null,null,null,null,null,null,null,null,null,null,null,null,null,null,null,null,{"$f":"IFERROR(IF(GY11<>\"\",GY11*'Job Infomation'!$B$21,\"\"),\"\")","v":""},{"$f":"IFERROR(IF(GZ11<>\"\",GZ11*'Job Infomation'!$B$21,\"\"),\"\")","v":""},{"$f":"IFERROR(IF(HA11<>\"\",HA11*'Job Infomation'!$B$21,\"\"),\"\")","v":""},{"$f":"IFERROR(IF(HB11<>\"\",HB11*'Job Infomation'!$B$21,\"\"),\"\")","v":""},{"$f":"IFERROR(IF(HC11<>\"\",HC11*'Job Infomation'!$B$21,\"\"),\"\")","v":""}]
["RER Fire Management Hours Avl.",null,null,null,null,null,{"$f":"IFERROR(IF(G11<>\"\",'Job Infomation'!$B$22-G12,\"\"),\"\")","v":184.05}]

{"sheet":"Material","index":3,"n_rows":1,"n_cols":8,"rows_kept":1,"cut":false,"hidden":false,"merged":[]}
["Part #","Qty","Ordered","Received","Received Qty","Received by","Delivered Qty","Delivered to"]